{"text_format":"1","workbook":"xlsx","n_sheets":3,"sheets":["ΜΚ","ΕΚΠΑΙΔ 2019-2020","ΕΚΠ (1)"],"not_rendered":{"charts":0,"images":0,"macros":1,"external_links":0,"defined_names":1,"comments":1,"pivot_tables":0},"unopened":[],"bounds":{"document_bytes":16777216,"sheet_cells":100000,"rows_first":2000,"rows_last":500,"rows_between":2000,"halvings":0,"cell_chars":16384,"cell_head_chars":4096},"cells_cut":0,"cells_raw":0,"read":"whole","date_system":"1900"}

{"sheet":"ΜΚ","index":0,"n_rows":159,"n_cols":6,"rows_kept":159,"cut":false,"hidden":false,"merged":[]}
["ΚΛΑΔΟΣ-ΕΤΗ","MK","BM","ΕΤΗ","ΆΛΛΟ ΧΡΟΝΟ ΓΙΑ ΝΈΟ ΜΚ","ΠΛΕΟΝΑΖΟΝΤΑ ΕΤΗ ΣΤΟ ΜΚ"]
["ΥΕ0",1,780,0,3,0]
["ΥΕ1",1,780,1,2,1]
["ΥΕ2",1,780,2,1,2]
["ΥΕ3",2,823,3,3,0]
["ΥΕ4",2,823,4,2,1]
["ΥΕ5",2,823,5,1,2]
["ΥΕ6",3,866,6,3,0]
["ΥΕ7",3,866,7,2,1]
["ΥΕ8",3,866,8,1,2]
["ΥΕ9",4,909,9,3,0]
["ΥΕ10",4,909,10,2,1]
["ΥΕ11",4,909,11,1,2]
["ΥΕ12",5,952,12,3,0]
["ΥΕ13",5,952,13,2,1]
["ΥΕ14",5,952,14,1,2]
["ΥΕ15",6,995,15,3,0]
["ΥΕ16",6,995,16,2,1]
["ΥΕ17",6,995,17,1,2]
["ΥΕ18",7,1038,18,3,0]
["ΥΕ19",7,1038,19,2,1]
["ΥΕ20",7,1038,20,1,2]
["ΥΕ21",8,1081,21,3,0]
["ΥΕ22",8,1081,22,2,1]
["ΥΕ23",8,1081,23,1,2]
["ΥΕ24",9,1124,24,3,0]
["ΥΕ25",9,1124,25,2,1]
["ΥΕ26",9,1124,26,1,2]
["ΥΕ27",10,1167,27,3,0]
["ΥΕ28",10,1167,28,2,1]
["ΥΕ29",10,1167,29,1,2]
["ΥΕ30",11,1210,30,3,0]
["ΥΕ31",11,1210,31,2,1]
["ΥΕ32",11,1210,32,1,2]
["ΥΕ33",12,1253,33,3,0]
["ΥΕ34",12,1253,34,2,1]
["ΥΕ35",12,1253,35,1,2]
["ΥΕ36",13,1296,36,3,0]
["ΥΕ37",13,1296,37,2,1]
["ΥΕ38",13,1296,38,1,2]
["ΥΕ39",13,1296,39,0,3]
["ΔΕ0",1,858,0,3,0]
["ΔΕ1",1,858,1,2,1]
["ΔΕ2",1,858,2,1,2]
["ΔΕ3",2,918,3,3,0]
["ΔΕ4",2,918,4,2,1]
["ΔΕ5",2,918,5,1,2]
["ΔΕ6",3,978,6,3,0]
["ΔΕ7",3,978,7,2,1]
["ΔΕ8",3,978,8,1,2]
["ΔΕ9",4,1038,9,3,0]
["ΔΕ10",4,1038,10,2,1]
["ΔΕ11",4,1038,11,1,2]
["ΔΕ12",5,1098,12,3,0]
["ΔΕ13",5,1098,13,2,1]
["ΔΕ14",5,1098,14,1,2]
["ΔΕ15",6,1158,15,3,0]
["ΔΕ16",6,1158,16,2,1]
["ΔΕ17",6,1158,17,1,2]
["ΔΕ18",7,1218,18,3,0]
["ΔΕ19",7,1218,19,2,1]
["ΔΕ20",7,1218,20,1,2]
["ΔΕ21",8,1278,21,3,0]
["ΔΕ22",8,1278,22,2,1]
["ΔΕ23",8,1278,23,1,2]
["ΔΕ24",9,1338,24,3,0]
["ΔΕ25",9,1338,25,2,1]
["ΔΕ26",9,1338,26,1,2]
["ΔΕ27",10,1398,27,3,0]
["ΔΕ28",10,1398,28,2,1]
["ΔΕ29",10,1398,29,1,2]
["ΔΕ30",11,1458,30,3,0]
["ΔΕ31",11,1458,31,2,1]
["ΔΕ32",11,1458,32,1,2]
["ΔΕ33",12,1518,33,3,0]
["ΔΕ34",12,1518,34,2,1]
["ΔΕ35",12,1518,35,1,2]
["ΔΕ36",13,1578,36,3,0]
["ΔΕ37",13,1578,37,2,1]
["ΔΕ38",13,1578,38,1,2]
["ΔΕ39",13,1578,39,0,3]
["ΤΕ0",1,1037,0,2,0]
["ΤΕ1",1,1037,1,1,1]
["ΤΕ2",2,1092,2,2,0]
["ΤΕ3",2,1092,3,1,1]
["ΤΕ4",3,1147,4,2,0]
["ΤΕ5",3,1147,5,1,1]
["ΤΕ6",4,1202,6,2,0]
["ΤΕ7",4,1202,7,1,1]
["ΤΕ8",5,1257,8,2,0]
["ΤΕ9",5,1257,9,1,1]
["ΤΕ10",6,1312,10,2,0]
["ΤΕ11",6,1312,11,1,1]
["ΤΕ12",7,1367,12,2,0]
["ΤΕ13",7,1367,13,1,1]
["ΤΕ14",8,1422,14,2,0]
["ΤΕ15",8,1422,15,1,1]
["ΤΕ16",9,1477,16,2,0]
["ΤΕ17",9,1477,17,1,1]
["ΤΕ18",10,1532,18,2,0]
["ΤΕ19",10,1532.2397999999994,19,1,1]
["ΤΕ20",11,1587,20,2,0]
["ΤΕ21",11,1587,21,1,1]
["ΤΕ22",12,1642,22,2,0]
["ΤΕ23",12,1642,23,1,1]
["ΤΕ24",13,1697,24,2,0]
["ΤΕ25",13,1697,25,1,1]
["ΤΕ26",14,1752,26,2,0]
["ΤΕ27",14,1752,27,1,1]
["ΤΕ28",15,1807,28,2,0]
["ΤΕ29",15,1807,29,1,1]
["ΤΕ30",16,1862,30,2,0]
["ΤΕ31",16,1862,31,1,1]
["ΤΕ32",17,1917,32,2,0]
["ΤΕ33",17,1917,33,1,1]
["ΤΕ34",18,1972,34,2,0]
["ΤΕ35",18,1972,35,1,1]
["ΤΕ36",19,2027,36,2,0]
["ΤΕ37",19,2027,37,1,1]
["ΤΕ38",19,2027,38,0,2]
["ΠΕ0",1,1092,0,2,0]
["ΠΕ1",1,1092,1,1,1]
["ΠΕ2",2,1151,2,2,0]
["ΠΕ3",2,1151,3,1,1]
["ΠΕ4",3,1210,4,2,0]
["ΠΕ5",3,1210,5,1,1]
["ΠΕ6",4,1269,6,2,0]
["ΠΕ7",4,1269,7,1,1]
["ΠΕ8",5,1328,8,2,0]
["ΠΕ9",5,1328,9,1,1]
["ΠΕ10",6,1387,10,2,0]
["ΠΕ11",6,1387,11,1,1]
["ΠΕ12",7,1446,12,2,0]
["ΠΕ13",7,1446,13,1,1]
["ΠΕ14",8,1505,14,2,0]
["ΠΕ15",8,1505,15,1,1]
["ΠΕ16",9,1564,16,2,0]
["ΠΕ17",9,1564,17,1,1]
["ΠΕ18",10,1623,18,2,0]
["ΠΕ19",10,1623,19,1,1]
["ΠΕ20",11,1682,20,2,0]
["ΠΕ21",11,1682,21,1,1]
["ΠΕ22",12,1741,22,2,0]
["ΠΕ23",12,1741,23,1,1]
["ΠΕ24",13,1800,24,2,0]
["ΠΕ25",13,1800,25,1,1]
["ΠΕ26",14,1859,26,2,0]
["ΠΕ27",14,1859,27,1,1]
["ΠΕ28",15,1918,28,2,0]
["ΠΕ29",15,1918,29,1,1]
["ΠΕ30",16,1977,30,2,0]
["ΠΕ31",16,1977,31,1,1]
["ΠΕ32",17,2036,32,2,0]
["ΠΕ33",17,2036,33,1,1]
["ΠΕ34",18,2095,34,2,0]
["ΠΕ35",18,2095,35,1,1]
["ΠΕ36",19,2154,36,2,0]
["ΠΕ37",19,2154,37,1,1]
["ΠΕ38",19,2154,38,0,2]

{"sheet":"ΕΚΠΑΙΔ 2019-2020","index":1,"n_rows":200,"n_cols":8,"rows_kept":200,"cut":false,"hidden":false,"merged":[]}
["Α/Α","ΑΦΜ","Επίθετο","Όνομα","Έναρξη σύμβασης","ΚΑΤΗΓΟΡΙΑ","ΜΤΧ","ΔΙΔ"]
[1,null,null,null,null,"ΠΕ","Όχι","Όχι"]
[2,null,null,null,null,"ΠΕ","Όχι","Όχι"]
[3,null,null,null,null,"ΠΕ","Όχι","Όχι"]
[4,null,null,null,null,"ΠΕ","Όχι","Όχι"]
[5,null,null,null,null,"ΠΕ","Όχι","Όχι"]
[6,null,null,null,null,"ΠΕ","Όχι","Όχι"]
[7,null,null,null,null,"ΠΕ","Όχι","Όχι"]
[8,null,null,null,null,"ΠΕ","Όχι","Όχι"]
[9,null,null,null,null,"ΠΕ","Όχι","Όχι"]
[10,null,null,null,null,"ΠΕ","Όχι","Όχι"]
[11,null,null,null,null,"ΠΕ","Όχι","Όχι"]
[12,null,null,null,null,"ΠΕ","Όχι","Όχι"]
[13,null,null,null,null,"ΠΕ","Όχι","Όχι"]
[14,null,null,null,null,"ΠΕ","Όχι","Όχι"]
[15,null,null,null,null,"ΔΕ","Όχι","Όχι"]
[16,null,null,null,null,"ΠΕ","Όχι","Όχι"]
[17,null,null,null,null,"ΠΕ","Όχι","Όχι"]
[18,null,null,null,null,"ΠΕ","Όχι","Όχι"]
[19,null,null,null,null,"ΠΕ","Όχι","Όχι"]
[20,null,null,null,null,"ΠΕ","Όχι","Όχι"]
[21,null,null,null,null,"ΠΕ","Όχι","Όχι"]
[22,null,null,null,null,"ΠΕ","Όχι","Όχι"]
[23,null,null,null,null,"ΠΕ","Όχι","Όχι"]
[24,null,null,null,null,"ΠΕ","Όχι","Όχι"]
[25,null,null,null,null,"ΠΕ","Όχι","Όχι"]
[26,null,null,null,null,"ΠΕ","Όχι","Όχι"]
[27,null,null,null,null,"ΠΕ","Όχι","Όχι"]
[28,null,null,null,null,"ΠΕ","Όχι","Όχι"]
[29,null,null,null,null,"ΠΕ","Όχι","Όχι"]
[30,null,null,null,null,"ΠΕ","Όχι","Όχι"]
[31,null,null,null,null,"ΠΕ","Όχι","Όχι"]
[32,null,null,null,null,"ΠΕ","Όχι","Όχι"]
[33,null,null,null,null,"ΠΕ","Όχι","Όχι"]
[34,null,null,null,null,"ΔΕ","Όχι","Όχι"]
[35,null,null,null,null,"ΠΕ","Όχι","Όχι"]
[36,null,null,null,null,"ΠΕ","Όχι","Όχι"]
[37,null,null,null,null,"ΠΕ","Όχι","Όχι"]
[38,null,null,null,null,"ΠΕ","Όχι","Όχι"]
[39,null,null,null,null,"ΠΕ","Όχι","Όχι"]
[40,null,null,null,null,"ΠΕ","Όχι","Όχι"]
[41,null,null,null,null,"ΠΕ","Όχι","Όχι"]
[42,null,null,null,null,"ΠΕ","Όχι","Όχι"]
[43,null,null,null,null,"ΠΕ","Όχι","Όχι"]
[44,null,null,null,null,"ΠΕ","Όχι","Όχι"]
[45,null,null,null,null,"ΠΕ","Όχι","Όχι"]
[46,null,null,null,null,"ΠΕ","Όχι","Όχι"]
[47,null,null,null,null,"ΠΕ","Όχι","Όχι"]
[48,null,null,null,null,"ΠΕ","Όχι","Όχι"]
[49,null,null,null,null,"ΠΕ","Όχι","Όχι"]
[50,null,null,null,null,"ΠΕ","Όχι","Όχι"]
[51,null,null,null,null,"ΠΕ","Όχι","Όχι"]
[52,null,null,null,null,"ΠΕ","Όχι","Όχι"]
[53,null,null,null,null,"ΠΕ","Όχι","Όχι"]
[54,null,null,null,null,"ΠΕ","Όχι","Όχι"]
[55,null,null,null,null,"ΠΕ","Όχι","Όχι"]
[56,null,null,null,null,"ΠΕ","Όχι","Όχι"]
[57,null,null,null,null,"ΠΕ","Όχι","Όχι"]
[58,null,null,null,null,"ΠΕ","Όχι","Όχι"]
[59,null,null,null,null,"ΠΕ","Όχι","Όχι"]
[60,null,null,null,null,"ΠΕ","Όχι","Όχι"]
[61,null,null,null,null,"ΠΕ","Όχι","Όχι"]
[62,null,null,null,null,"ΠΕ","Όχι","Όχι"]
[63,null,null,null,null,"ΠΕ","Όχι","Όχι"]
[64,null,null,null,null,"ΠΕ","Όχι","Όχι"]
[65,null,null,null,null,"ΠΕ","Όχι","Όχι"]
[66,null,null,null,null,"ΠΕ","Όχι","Όχι"]
[67,null,null,null,null,"ΠΕ","Όχι","Όχι"]
[68,null,null,null,null,"ΠΕ","Όχι","Όχι"]
[69,null,null,null,null,"ΠΕ","Όχι","Όχι"]
[70,null,null,null,null,"ΠΕ","Όχι","Όχι"]
[71,null,null,null,null,"ΠΕ","Όχι","Όχι"]
[72,null,null,null,null,"ΠΕ","Όχι","Όχι"]
[73,null,null,null,null,"ΠΕ","Όχι","Όχι"]
[74,null,null,null,null,"ΠΕ","Όχι","Όχι"]
[75,null,null,null,null,"ΠΕ","Όχι","Όχι"]
[76,null,null,null,null,"ΠΕ","Όχι","Όχι"]
[77,null,null,null,null,"ΠΕ","Όχι","Όχι"]
[78,null,null,null,null,"ΠΕ","Όχι","Όχι"]
[79,null,null,null,null,"ΠΕ","Όχι","Όχι"]
[80,null,null,null,null,"ΠΕ","Όχι","Όχι"]
[81,null,null,null,null,"ΠΕ","Όχι","Όχι"]
[82,null,null,null,null,"ΠΕ","Όχι","Όχι"]
[83,null,null,null,null,"ΠΕ","Όχι","Όχι"]
[84,null,null,null,null,"ΠΕ","Όχι","Όχι"]
[85,null,null,null,null,"ΠΕ","Όχι","Όχι"]
[86,null,null,null,null,"ΠΕ","Όχι","Όχι"]
[87,null,null,null,null,"ΠΕ","Όχι","Όχι"]
[88,null,null,null,null,"ΠΕ","Όχι","Όχι"]
[89,null,null,null,null,"ΠΕ","Όχι","Όχι"]
[90,null,null,null,null,"ΠΕ","Όχι","Όχι"]
[91,null,null,null,null,"ΠΕ","Όχι","Όχι"]
[92,null,null,null,null,"ΠΕ","Όχι","Όχι"]
[93,null,null,null,null,"ΠΕ","Όχι","Όχι"]
[94,null,null,null,null,"ΠΕ","Όχι","Όχι"]
[95,null,null,null,null,"ΠΕ","Όχι","Όχι"]
[96,null,null,null,null,"ΠΕ","Όχι","Όχι"]
[97,null,null,null,null,"ΠΕ","Όχι","Όχι"]
[98,null,null,null,null,"ΠΕ","Όχι","Όχι"]
[99,null,null,null,null,"ΠΕ","Όχι","Όχι"]
[100,null,null,null,null,"ΠΕ","Όχι","Όχι"]
[101,null,null,null,null,"ΠΕ","Όχι","Όχι"]
[102,null,null,null,null,"ΠΕ","Όχι","Όχι"]
[103,null,null,null,null,"ΠΕ","Όχι","Όχι"]
[104,null,null,null,null,"ΠΕ","Όχι","Όχι"]
[105,null,null,null,null,"ΠΕ","Όχι","Όχι"]
[106,null,null,null,null,"ΠΕ","Όχι","Όχι"]
[107,null,null,null,null,"ΠΕ","Όχι","Όχι"]
[108,null,null,null,null,"ΠΕ","Όχι","Όχι"]
[109,null,null,null,null,"ΠΕ","Όχι","Όχι"]
[110,null,null,null,null,"ΠΕ","Όχι","Όχι"]
[111,null,null,null,null,"ΠΕ","Όχι","Όχι"]
[112,null,null,null,null,"ΠΕ","Όχι","Όχι"]
[113,null,null,null,null,"ΠΕ","Όχι","Όχι"]
[114,null,null,null,null,"ΠΕ","Όχι","Όχι"]
[115,null,null,null,null,"ΠΕ","Όχι","Όχι"]
[116,null,null,null,null,"ΠΕ","Όχι","Όχι"]
[117,null,null,null,null,"ΠΕ","Όχι","Όχι"]
[118,null,null,null,null,"ΠΕ","Όχι","Όχι"]
[119,null,null,null,null,"ΠΕ","Όχι","Όχι"]
[120,null,null,null,null,"ΠΕ","Όχι","Όχι"]
[121,null,null,null,null,"ΠΕ","Όχι","Όχι"]
[122,null,null,null,null,"ΠΕ","Όχι","Όχι"]
[123,null,null,null,null,"ΠΕ","Όχι","Όχι"]
[124,null,null,null,null,"ΠΕ","Όχι","Όχι"]
[125,null,null,null,null,"ΠΕ","Όχι","Όχι"]
[126,null,null,null,null,"ΠΕ","Όχι","Όχι"]
[127,null,null,null,null,"ΠΕ","Όχι","Όχι"]
[128,null,null,null,null,"ΠΕ","Όχι","Όχι"]
[129,null,null,null,null,"ΠΕ","Όχι","Όχι"]
[130,null,null,null,null,"ΠΕ","Όχι","Όχι"]
[131,null,null,null,null,"ΠΕ","Όχι","Όχι"]
[132,null,null,null,null,"ΠΕ","Όχι","Όχι"]
[133,null,null,null,null,"ΠΕ","Όχι","Όχι"]
[134,null,null,null,null,"ΠΕ","Όχι","Όχι"]
[135,null,null,null,null,"ΠΕ","Όχι","Όχι"]
[136,null,null,null,null,"ΠΕ","Όχι","Όχι"]
[137,null,null,null,null,"ΠΕ","Όχι","Όχι"]
[138,null,null,null,null,"ΠΕ","Όχι","Όχι"]
[139,null,null,null,null,"ΠΕ","Όχι","Όχι"]
[140,null,null,null,null,"ΠΕ","Όχι","Όχι"]
[141,null,null,null,null,"ΠΕ","Όχι","Όχι"]
[142,null,null,null,null,"ΠΕ","Όχι","Όχι"]
[143,null,null,null,null,"ΠΕ","Όχι","Όχι"]
[144,null,null,null,null,"ΠΕ","Όχι","Όχι"]
[145,null,null,null,null,"ΠΕ","Όχι","Όχι"]
[146,null,null,null,null,"ΠΕ","Όχι","Όχι"]
[147,null,null,null,null,"ΠΕ","Όχι","Όχι"]
[148,null,null,null,null,"ΠΕ","Όχι","Όχι"]
[149,null,null,null,null,"ΠΕ","Όχι","Όχι"]
[150,null,null,null,null,"ΠΕ","Όχι","Όχι"]
[151,null,null,null,null,"ΠΕ","Όχι","Όχι"]
[152,null,null,null,null,"ΠΕ","Όχι","Όχι"]
[153,null,null,null,null,"ΠΕ","Όχι","Όχι"]
[154,null,null,null,null,"ΠΕ","Όχι","Όχι"]
[155,null,null,null,null,"ΠΕ","Όχι","Όχι"]
[156,null,null,null,null,"ΠΕ","Όχι","Όχι"]
[157,null,null,null,null,"ΠΕ","Όχι","Όχι"]
[158,null,null,null,null,"ΠΕ","Όχι","Όχι"]
[159,null,null,null,null,"ΠΕ","Όχι","Όχι"]
[160,null,null,null,null,"ΠΕ","Όχι","Όχι"]
[161,null,null,null,null,"ΠΕ","Όχι","Όχι"]
[162,null,null,null,null,"ΠΕ","Όχι","Όχι"]
[163,null,null,null,null,"ΠΕ","Όχι","Όχι"]
[164,null,null,null,null,"ΠΕ","Όχι","Όχι"]
[165,null,null,null,null,"ΠΕ","Όχι","Όχι"]
[166,null,null,null,null,"ΠΕ","Όχι","Όχι"]
[167,null,null,null,null,"ΠΕ","Όχι","Όχι"]
[168,null,null,null,null,"ΠΕ","Όχι","Όχι"]
[169,null,null,null,null,"ΠΕ","Όχι","Όχι"]
[170,null,null,null,null,"ΠΕ","Όχι","Όχι"]
[171,null,null,null,null,"ΠΕ","Όχι","Όχι"]
[172,null,null,null,null,"ΠΕ","Όχι","Όχι"]
[173,null,null,null,null,"ΠΕ","Όχι","Όχι"]
[174,null,null,null,null,"ΠΕ","Όχι","Όχι"]
[175,null,null,null,null,"ΠΕ","Όχι","Όχι"]
[176,null,null,null,null,"ΠΕ","Όχι","Όχι"]
[177,null,null,null,null,"ΠΕ","Όχι","Όχι"]
[178,null,null,null,null,"ΠΕ","Όχι","Όχι"]
[179,null,null,null,null,"ΠΕ","Όχι","Όχι"]
[180,null,null,null,null,"ΠΕ","Όχι","Όχι"]
[181,null,null,null,null,"ΠΕ","Όχι","Όχι"]
[182,null,null,null,null,"ΠΕ","Όχι","Όχι"]
[183,null,null,null,null,"ΠΕ","Όχι","Όχι"]
[184,null,null,null,null,"ΠΕ","Όχι","Όχι"]
[185,null,null,null,null,"ΠΕ","Όχι","Όχι"]
[186,null,null,null,null,"ΠΕ","Όχι","Όχι"]
[187,null,null,null,null,"ΠΕ","Όχι","Όχι"]
[188,null,null,null,null,"ΠΕ","Όχι","Όχι"]
[189,null,null,null,null,"ΠΕ","Όχι","Όχι"]
[190,null,null,null,null,"ΠΕ","Όχι","Όχι"]
[191,null,null,null,null,"ΠΕ","Όχι","Όχι"]
[192,null,null,null,null,"ΠΕ","Όχι","Όχι"]
[193,null,null,null,null,"ΠΕ","Όχι","Όχι"]
[194,null,null,null,null,"ΠΕ","Όχι","Όχι"]
[195,null,null,null,null,"ΠΕ","Όχι","Όχι"]
[196,null,null,null,null,"ΠΕ","Όχι","Όχι"]
[197,null,null,null,null,"ΠΕ","Όχι","Όχι"]
[198,null,null,null,null,"ΠΕ","Όχι","Όχι"]
[199,null,null,null,null,"ΠΕ","Όχι","Όχι"]

{"sheet":"ΕΚΠ (1)","index":2,"n_rows":105,"n_cols":100,"rows_kept":105,"cut":false,"hidden":false,"merged":[[0,0,0,33],[1,0,1,33],[2,0,3,1],[2,2,3,3],[2,4,3,4],[2,5,3,5],[2,9,3,9],[2,10,3,10],[2,11,3,11],[2,6,2,7],[2,26,3,26],[2,27,2,29],[2,30,3,30],[2,31,2,33],[2,23,3,23],[2,24,3,24],[4,0,4,1],[4,2,4,3],[2,20,3,20],[2,21,3,21],[2,22,3,22],[2,18,3,18],[2,19,3,19],[2,25,3,25],[2,12,3,12],[2,13,3,13],[2,14,3,16],[2,17,3,17],[8,13,14,27],[15,13,19,27],[5,0,5,33],[6,0,6,1],[6,2,7,3],[6,4,6,5],[6,6,6,8],[6,9,7,11],[6,13,7,27],[25,0,28,3],[25,4,25,5],[26,4,26,5],[27,4,27,5],[28,4,28,5]]}
["ΠΡΟΣΟΧΗ : Συμπληρώνετε ΜΟΝΟ τα ΚΕΛΙΑ με πράσινο χρώμα που είναι απαραίτητα."]
["Υπολογισμός: α)Συνολικής Προϋπηρεσίας (πλην των ετών 2016-2017) β)ΜΚ  γ)Επόμενου ΜΚ  και δ)Προϋπηρεσίας Απόλυσης "]
["ΑΦΜ (συμπληρώστε)",null,"Επίθετο                                  (αυτόματα)",null,"Όνομα        (αυτόματα)","Έναρξη σύμβασης    (αυτόματα)","α)ΣΥΝΟΛΙΚΗ ΠΡΟΫΠΗΡΕΣΙΑ ?",null,"ΑΥΤΟΜΑΤΑ","ΚΑΤ. (αυτόμ.)","ΜΤΧ (αυτόμ.)","ΔΙΔ  (αυτόμ.)","ΣΥΝ. ΕΤΗ","β) MK","ΗΜΕΡΟΜΗΝΙΑ ΠΡΟΣΛΗΨΗΣ",null,null,"υπόλ. έτη","υπόλ. μήνες","υπόλ. ημέρες","ΣΥΝ. ΗΗ","ΗΗ","+MM","ΣΥΝ. ΜΜ","ΜΜ","+ΕΕ","ΣΥΝ. ΕΕ","γ) ΕΠΟΜΕΝΟ ΜΚ",null,null,"Λήξη Σύμβασης","δ)ΠΡΟΫΠΗΡΕΣΙΑ  ΑΠΟΛΥΣΗΣ"]
[null,null,null,null,null,null,"ΕΤΗ","ΜΗΝΕΣ","ΗΜΕΡΕΣ",null,null,null,null,null,null,null,null,null,null,null,null,null,null,null,null,null,null,"ΗΜΕΡΟΜΗΝΙΑ","ΜΚ","ΜΗΝΑΣ",null,"ΣΕ ΕΕ","ΣΕ ΜΜ","ΣΕ ΗΗ"]
[null,null,null,null,null,null,0,0,0,"ΠΕ","Όχι","Όχι",{"$f":"$G5+IF($K5=\"Ναι\",4,0)+IF($L5=\"Ναι\",8,0)","v":0},{"$f":"IF(OR($J5=\" \",J5=\" \"),1,VLOOKUP(CONCATENATE($J5,$M5),ΜΚ!$A$2:$B$159,2,FALSE))","v":1},{"$f":"DAY($F5)","v":0},{"$f":"MONTH($F5)","v":1},{"$f":"YEAR($F5)","v":1900},{"$f":"IF(ISERROR(VLOOKUP(CONCATENATE($J5,$M5),ΜΚ!$A$2:$F$159,5,FALSE)-1),\"\",VLOOKUP(CONCATENATE($J5,$M5),ΜΚ!$A$2:$F$159,5,FALSE)-1)","v":1},{"$f":"IF(ISERROR(VLOOKUP(CONCATENATE($J5,$M5),ΜΚ!$A$2:$F$159,5,FALSE)-1),\"\",11-$H5)","v":11},{"$f":"IF(ISERROR(VLOOKUP(CONCATENATE($J5,$M5),ΜΚ!$A$2:$F$159,5,FALSE)-1),\"\",30-$I5)","v":30},{"$f":"$O5+$T5","v":30},{"$f":"IF($U5>30,$U5-30,$U5)","v":30},{"$f":"IF($U5>30,1,0)","v":0},{"$f":"$P5+$S5+$W5","v":12},{"$f":"IF($X5>12,$X5-12,$X5)","v":12},{"$f":"IF($X5>12,1,0)","v":0},{"$f":"$Q5+$R5+$Z5","v":1901},{"$f":"IF($F5=\"\",\"\",IF(DATE($AA5,$Y5,$V5)>$AE5,\"OΧΙ ΦΕΤΟΣ\",DATE($AA5,$Y5,$V5)))","v":""},{"$f":"IFERROR(\"-\",IF(OR($F5=\"\",$AB5=\"OΧΙ ΦΕΤΟΣ\"),\" -\",$N5+1))","v":"-"},{"$f":"IF($AB5<DATE(2020,6,21),AB5,\"ΟΧΙ ΦΕΤΟΣ \")","v":"ΟΧΙ ΦΕΤΟΣ "},{"$f":"IF($F5=\"\",\"\",DATE(IF(AND(MONTH($F5)>=9,MONTH($F5)<=12),YEAR($F5)+1,YEAR($F5)),6,21))","v":""},{"$f":"IF($F5=\"\",0,INT(DAYS360($F5-1,$AE5)/360))","v":0},{"$f":"IF($F5=\"\",0,INT((DAYS360($F5-1,$AE5)/360-$AF5)*360/30))","v":0},{"$f":"IF($F5=\"\",0,((DAYS360($F5-1,$AE5)/360-$AF5)*360/30-$AG5)*30)","v":0}]
["Συμπληρώνετε στον παρακάτω πίνακα ΟΛΕΣ τις προϋπηρεσίες και εμφανίζεται ΑΥΤΟΜΑΤΑ πάνω η συνολική προϋπηρεσία ή επιλέγετε ΣΥΜΠΛΗΡΩΣΗ και συμπληρώνετε κατευθείαν την α)ΣΥΝΟΛΙΚΗ ΠΡΟΫΠΗΡΕΣΙΑ"]
["ΓΙΑ ΜΕΙΩΜΕΝΟ",null,"ΑΝΑ ΣΧΟΛΙΚΟ ΕΤΟΣ",null,"ΗΜΕΡΟΜΗΝΙΕΣ ΣΥΜΒΑΣΗΣ",null,"ΠΡΟΫΠΗΡΕΣΙΑ (αυτόματα)",null,null,"πατήστε ΕΔΩ                    ΠΡΟΫΠΗΡΕΣΙΑ 2016-2017",null,null,null,"ΣΥΜΠΛΗΡΩΝΕΤΕ TΗΝ ΠΡΟΫΠΗΡΕΣΙΑ ΑΝΑ ΣΧΟΛΙΚΟ ΕΤΟΣ"]
["ΥΠΟΧΡ.","ΩΡΕΣ/ΕΤΟΣ",null,null,"ΑΠΟ","ΜΕΧΡΙ (αυτόματα)","ΕΤΗ","ΜΗΝΕΣ","ΗΜΕΡΕΣ"]
[24,0,null,null,null,{"$f":"IF($E9=\"\",\"\",DATE(IF(AND(MONTH($E9)>=9,MONTH($E9)<=12),YEAR($E9)+1,YEAR($E9)),6,21))","v":""},{"$f":"IF($B9<>0,0,IF($E9=\"\",0,INT(DAYS360($E9-1,$F9)/360)))","v":0},{"$f":"IF($B9<>0,INT(($B9/$A9)*(6/25)),IF($E9=\"\",0,INT((DAYS360($E9-1,$F9)/360-$G9)*12)))","v":0},{"$f":"IF($B9<>0,((($B9/$A9)*(6/25))-INT(($B9/$A9)*(6/25)))*30,IF($E9=\"\",0,((DAYS360($E9-1,$F9)/360-$G9)*12-$H9)*30))","v":0},0,0,0,null,"Συμπληρώνετε την Ημερομηνία Σύμβασης ΑΠΟ και υπολογίζεται η Προϋπηρεσία αυτόματα.                                                                 Για να υπολογιστεί η Προϋπηρεσία 2016-2017 που αφαιρείται,                                    πατήστε ΕΔΩ                                       ΠΡΟΫΠΗΡΕΣΙΑ 2016-2017.                                                                                                                                                                                                                                                                                                         "]
[24,0,null,null,null,{"$f":"IF($E10=\"\",\"\",DATE(IF(AND(MONTH($E10)>=9,MONTH($E10)<=12),YEAR($E10)+1,YEAR($E10)),6,21))","v":""},0,0,0,0,0,0]
[24,0,null,null,null,"",0,0,0,0,0,0]
[24,0,null,null,null,"",{"$f":"IF($B12<>0,0,IF($E12=\"\",0,INT(DAYS360($E12-1,$F12)/360)))","v":0},0,0,0,0,0]
[24,0,null,null,null,"",{"$f":"IF($B13<>0,0,IF($E13=\"\",0,INT(DAYS360($E13-1,$F13)/360)))","v":0},0,0,0,0,0]
[24,0,null,null,null,"",0,0,0,0,0,0]
[24,0,null,null,null,"",0,0,0,0,0,0]
[24,0,null,null,null,"",0,0,0,0,0,0,null,"Μειωμένου Ωραρίου Προϋπηρεσίες     Στο τέλος, συμπληρώνετε τις συνολικές ΩΡΕΣ/ΕΤΟΣ και τις Προϋπηρεσίες 2016-2017 χειρόγραφα στις στήλες του πατήστε ΕΔΩ ΠΡΟΫΠΗΡΕΣΙΑ 2016-2017"]
[24,0,null,null,null,"",0,0,0,0,0,0]
[24,0,null,null,null,"",0,0,0,0,0,0]
[24,0,null,null,null,"",0,0,0,0,0,0]
[24,0,null,null,null,"",0,0,0,0,0,0]
[24,0,null,null,null,"",0,0,0,0,0,0]
[24,0,null,null,null,"",0,0,0,0,0,0]
[24,0,null,null,null,"",0,0,0,0,0,0]
[24,0,null,null,null,"",0,0,0,0,0,0]
[24,0,null,null,null,"",0,0,0,0,0,0]
["ΑΦΑΙΡΕΙΤΑΙ το χρονικό διάστημα από    1/1/2016 μέχρι και 31/12/2017                 σύμφωνα με το Ν. 4354/2015.",null,null,null,"ΣΥΝΟΛΑ",null,{"$f":"SUM(G9:G25)","v":0},0,0,0,0,0]
[null,null,null,null,"ΕΝΔΙΑΜΕΝΟΙ ΥΠΟΛΟΓΙΣΜΟΙ",null,{"$f":"SUM(G9:G25)-SUM(J9:J25)","v":0},{"$f":"SUM(H9:H25)-SUM(K9:K25)","v":0},{"$f":"SUM(I9:I25)-SUM(L9:L25)","v":0}]
[null,null,null,null,"+EE +MM",null,null,{"$f":"$H27+INT($I27/30)","v":0},{"$f":"(($I27/30)-INT($I27/30))*30","v":0}]
[null,null,null,null,"ΣΥΝΟΛΙΚΗ ΠΡΟΫΠΗΡΕΣΙΑ                                                               (έχει αφαιρεθεί 2016-2017)",null,{"$f":"$G27+INT($H28/12)","v":0},{"$f":"(($H28/12)-INT($H28/12))*12","v":0},{"$f":"$I28","v":0}]
[]
[]
[]
[]
[]
[]
[]
[]
[]
[]
[]
[]
[]
[]
[]
[]
[]
[]
[]
[]
[]
[]
[]
[]
[]
[]
[]
[]
[]
[]
[]
[]
[]
[]
[]
[]
[]
[]
[]
[]
[]
[]
[]
[]
[]
[]
[]
[]
[]
[]
[]
[]
[]
[]
[]
[]
[]
[]
[]
[]
[]
[]
[]
[]
[]
[]
[]
[]
[]
[]
[]
[]
[]
[]
[]
[null,null,null,null,null,null,null,null,null,null,null,null,null,null,null,null,null,null,null,null,null,null,null,null,null,null,null,null,null,null,null,null,null,null,null,null,null,null,null,null,null,null,null,null,null,null,null,null,null,null,null,null,null,null,null,null,null,null,null,null,null,null,null,null,null,null,null,null,null,null,null,null,null,null,null,null,null,null,null,null,null,null,null,null,null,null,null,null,null,null,null,null,null,null,null,null,null,null,null,{"$error":"#N/A"}]